Update .gitlab-ci.yml

2 jobs for develop in 15 seconds (queued for 1 second)
latest
Status Name Job ID Coverage
  Test
failed test #166968
DEV

00:00:15

 
  Deploy
skipped pack #166969
DEV
 
Name Stage Failure
failed
test Test

Run `npm audit` for details.
$ npm test
npm ERR! missing script: test

npm ERR! A complete log of this run can be found in:
npm ERR! /root/.npm/_logs/2021-01-22T09_06_46_745Z-debug.log
Cleaning up file based variables
ERROR: Job failed: exit code 1