Update .gitlab-ci.yml

2 jobs for develop in 22 seconds (queued for 4 seconds)
Status Name Job ID Coverage
  Test
failed test #166960

00:00:22

 
  Deploy
skipped pack #166961
DEV
 
Name Stage Failure
failed
test Test
Run `npm audit` for details.
$ npm test
npm ERR! missing script: test

npm ERR! A complete log of this run can be found in:
npm ERR! /root/.npm/_logs/2021-01-22T09_04_02_941Z-debug.log
Running after_script
Uploading artifacts for failed job
ERROR: Job failed: exit code 1