Add template header to readme

2 jobs for develop in 23 seconds (queued for 2 seconds)
Status Name Job ID Coverage
  Test
failed test #166958

00:00:23

 
  Deploy
skipped pack #166959
 
Name Stage Failure
failed
test Test
Run `npm audit` for details.
$ npm test
npm ERR! missing script: test

npm ERR! A complete log of this run can be found in:
npm ERR! /root/.npm/_logs/2021-01-22T09_03_19_519Z-debug.log
Running after_script
Uploading artifacts for failed job
ERROR: Job failed: exit code 1