Update package.json

2 jobs for hoangld-update-CI in 16 seconds (queued for 1 second)
Status Name Job ID Coverage
  Test
failed test #166953
DEV

00:00:16

 
  Deploy
skipped pack #166954
 
Name Stage Failure
failed
test Test
npm ERR! this command with --force, or --legacy-peer-deps
npm ERR! to accept an incorrect (and potentially broken) dependency resolution.
npm ERR!
npm ERR! See /root/.npm/eresolve-report.txt for a full report.

npm ERR! A complete log of this run can be found in:
npm ERR! /root/.npm/_logs/2021-01-22T08_50_32_521Z-debug.log
Cleaning up file based variables
ERROR: Job failed: exit code 1