Update package.json

2 jobs for hoangld-update-CI in 24 seconds (queued for 2 seconds)
Status Name Job ID Coverage
  Test
failed test #166950
DEV

00:00:24

 
  Deploy
skipped pack #166951
 
Name Stage Failure
failed
test Test
npm ERR! code 127
npm ERR! path /builds/hoangld/nodejs-startup
npm ERR! command failed
npm ERR! command sh -c eslint ./

npm ERR! A complete log of this run can be found in:
npm ERR! /root/.npm/_logs/2021-01-22T08_49_16_608Z-debug.log
Cleaning up file based variables
ERROR: Job failed: exit code 1