Add template header to readme

2 jobs for hoangld-update-CI in 1 minute and 33 seconds (queued for 3 seconds)
Status Name Job ID Coverage
  Test
failed test #166881

00:01:33

 
  Deploy
skipped pack #166882
 
Name Stage Failure
failed
test Test
Run `npm audit` for details.
$ npm test
npm ERR! missing script: test

npm ERR! A complete log of this run can be found in:
npm ERR! /root/.npm/_logs/2021-01-22T06_55_57_532Z-debug.log
Running after_script
Uploading artifacts for failed job
ERROR: Job failed: exit code 1